"Modified AA","PTM Type",Peptide,"Position in Peptide","Protein ID","Protein Description","Position in Protein","Localization Prob","Identification Score","Posterior Error Prob","Mass Error(ppm)","Quant log2 FC","Quant p-val/q-val/FDR","Quant Significant"
C,S-nitrosylation,QCSSGLQAVADVAAAIK,2,AT1G04710.1,"peroxisomal 3-ketoacyl-CoA thiolase 4",130,,,,,,,
C,S-nitrosylation,QCSSGLQAVADVAAAIK,2,AT2G33150.1,"peroxisomal 3-ketoacyl-CoA thiolase 3",138,,,,,,,
C,S-nitrosylation,NCAPIMVR,2,AT1G07890.1,"ascorbate peroxidase 1",32,,,,,,,
C,S-nitrosylation,NCAPIMVR,2,AT1G07890.2,"ascorbate peroxidase 1",32,,,,,,,
C,S-nitrosylation,NCAPIMVR,2,AT1G07890.3,"ascorbate peroxidase 1",32,,,,,,,
C,S-nitrosylation,NCAPIMVR,2,AT1G07890.4,"ascorbate peroxidase 1",32,,,,,,,
C,S-nitrosylation,NCAPIMVR,2,AT1G07890.5,"ascorbate peroxidase 1",32,,,,,,,
C,S-nitrosylation,NCAPIMVR,2,AT1G07890.6,"ascorbate peroxidase 1",32,,,,,,,
C,S-nitrosylation,NCAPIMVR,2,AT1G07890.7,"ascorbate peroxidase 1",32,,,,,,,
C,S-nitrosylation,NCAPIMVR,2,AT1G07890.8,"ascorbate peroxidase 1",32,,,,,,,
C,S-nitrosylation,YYCTVIDAPGHR,3,AT1G07920.1,"GTP binding Elongation factor Tu family protein",87,,,,,0.2152061,0.1273343,NO
C,S-nitrosylation,YYCTVIDAPGHR,3,AT1G07930.1,"GTP binding Elongation factor Tu family protein",87,,,,,0.2152061,0.1273343,NO
C,S-nitrosylation,YYCTVIDAPGHR,3,AT1G07930.2,"GTP binding Elongation factor Tu family protein",87,,,,,0.2152061,0.1273343,NO
C,S-nitrosylation,YYCTVIDAPGHR,3,AT1G07940.1,"GTP binding Elongation factor Tu family protein",87,,,,,0.2152061,0.1273343,NO
C,S-nitrosylation,YYCTVIDAPGHR,3,AT1G07940.2,"GTP binding Elongation factor Tu family protein",87,,,,,0.2152061,0.1273343,NO
C,S-nitrosylation,YYCTVIDAPGHR,3,AT1G07940.3,"GTP binding Elongation factor Tu family protein",87,,,,,0.2152061,0.1273343,NO
C,S-nitrosylation,YYCTVIDAPGHR,3,AT1G07940.4,"GTP binding Elongation factor Tu family protein",87,,,,,0.2152061,0.1273343,NO
C,S-nitrosylation,YYCTVIDAPGHR,3,AT5G60390.1,"GTP binding Elongation factor Tu family protein",87,,,,,0.2152061,0.1273343,NO
C,S-nitrosylation,YYCTVIDAPGHR,3,AT5G60390.2,"GTP binding Elongation factor Tu family protein",87,,,,,0.2152061,0.1273343,NO
C,S-nitrosylation,YYCTVIDAPGHR,3,AT5G60390.3,"GTP binding Elongation factor Tu family protein",87,,,,,0.2152061,0.1273343,NO
C,S-nitrosylation,LCDQALASGK,2,AT1G09780.1,"Phosphoglycerate mutase, 2,3-bisphosphoglycerate-independent",100,,,,,0.0415363,0.9182384,NO
C,S-nitrosylation,AAVGAPDHLGDCPFSQR,12,AT1G19570.1,"dehydroascorbate reductase",20,,,,,1.6447427,0.0016333,YES
C,S-nitrosylation,VCNDILSVIDK,2,AT1G22300.1,"general regulatory factor 10",98,,,,,0.5126766,0.0004548,NO
C,S-nitrosylation,VCNDILSVIDK,2,AT1G22300.2,"general regulatory factor 10",98,,,,,0.5126766,0.0004548,NO
C,S-nitrosylation,VCNDILSVIDK,2,AT1G22300.3,"general regulatory factor 10",98,,,,,0.5126766,0.0004548,NO
C,S-nitrosylation,GVDGTCDQIR,6,AT1G47128.1,"Granulin repeat cysteine protease family protein",233,,,,,,,
C,S-nitrosylation,CGIAIEPSYPIK,1,AT1G47128.1,"Granulin repeat cysteine protease family protein",342,,,,,-0.2760308,0.1674830,NO
C,S-nitrosylation,NCDPNGPLMLYVSK,2,AT1G56070.1,"Ribosomal protein S5/Elongation factor G/III/V family protein",370,,,,,-0.0117075,0.8674575,NO
C,S-nitrosylation,NCDPNGPLMLYVSK,2,AT1G56070.2,"Ribosomal protein S5/Elongation factor G/III/V family protein",370,,,,,-0.0117075,0.8674575,NO
C,S-nitrosylation,NCDPNGPLMLYVSK,2,AT1G56070.3,"Ribosomal protein S5/Elongation factor G/III/V family protein",370,,,,,-0.0117075,0.8674575,NO
C,S-nitrosylation,DVEEEIIPTCR,10,AT1G60710.1,"NAD(P)-linked oxidoreductase superfamily protein",198,,,,,,,
C,S-nitrosylation,NYENVCTLR,6,AT1G63000.1,"nucleotide-rhamnose synthase/epimerase-reductase",162,,,,,0.5608544,0.0004940,NO
C,S-nitrosylation,CATITPDEGR,1,AT1G65930.1,"cytosolic NADP+-dependent isocitrate dehydrogenase",75,,,,,,,
C,S-nitrosylation,CATITPDEGR,1,AT5G14590.1,"Isocitrate/isopropylmalate dehydrogenase family protein",145,,,,,,,
C,S-nitrosylation,SEGGYVWACK,9,AT1G54340.1,"isocitrate dehydrogenase",270,,,,,0.2434103,0.2359012,NO
C,S-nitrosylation,SEGGYVWACK,9,AT1G54340.2,"isocitrate dehydrogenase",270,,,,,0.2434103,0.2359012,NO
C,S-nitrosylation,SEGGYVWACK,9,AT1G65930.1,"cytosolic NADP+-dependent isocitrate dehydrogenase",269,,,,,0.2434103,0.2359012,NO
C,S-nitrosylation,SEGGYVWACK,9,AT5G14590.1,"Isocitrate/isopropylmalate dehydrogenase family protein",340,,,,,0.2434103,0.2359012,NO
C,S-nitrosylation,LEAACVGTVESGK,5,AT1G65930.1,"cytosolic NADP+-dependent isocitrate dehydrogenase",363,,,,,0.0025972,0.9573839,NO
C,S-nitrosylation,EFGVTECVNPK,7,AT1G77120.1,"alcohol dehydrogenase 1",243,,,,,,,
C,S-nitrosylation,TTQFCSGVK,5,AT1G78830.1,"Curculin-like (mannose-binding) lectin family protein",374,,,,,-2.1317679,0.0001783,YES
C,S-nitrosylation,FANACGAITTTK,5,AT1G06020.1,"pfkB-like carbohydrate kinase family protein",299,,,,,,,
C,S-nitrosylation,FANACGAITTTK,5,AT1G06030.1,"pfkB-like carbohydrate kinase family protein",300,,,,,,,
C,S-nitrosylation,FANACGAITTTK,5,AT2G31390.1,"pfkB-like carbohydrate kinase family protein",298,,,,,,,
C,S-nitrosylation,SFQCELVMAK,4,AT2G39730.1,"rubisco activase",175,,,,,-1.5006815,0.0001157,YES
C,S-nitrosylation,SFQCELVMAK,4,AT2G39730.2,"rubisco activase",175,,,,,-1.5006815,0.0001157,YES
C,S-nitrosylation,SFQCELVMAK,4,AT2G39730.3,"rubisco activase",175,,,,,-1.5006815,0.0001157,YES
C,S-nitrosylation,GLSIPECQK,7,AT2G44350.1,"Citrate synthase family protein",108,,,,,0.2319333,0.2195233,NO
C,S-nitrosylation,GLSIPECQK,7,AT2G44350.2,"Citrate synthase family protein",109,,,,,0.2319333,0.2195233,NO
C,S-nitrosylation,GLSIPECQK,7,AT2G44350.3,"Citrate synthase family protein",109,,,,,0.2319333,0.2195233,NO
C,S-nitrosylation,GLSIPECQK,7,AT2G44350.4,"Citrate synthase family protein",108,,,,,0.2319333,0.2195233,NO
C,S-nitrosylation,NLSQQCLNALAK,6,AT2G45290.1,Transketolase,440,,,,,-0.5496883,0.0175350,NO
C,S-nitrosylation,NLSQQCLNALAK,6,AT2G45290.2,Transketolase,440,,,,,-0.5496883,0.0175350,NO
C,S-nitrosylation,NLSQQCLNALAK,6,AT3G60750.1,Transketolase,440,,,,,-0.5496883,0.0175350,NO
C,S-nitrosylation,NLSQQCLNALAK,6,AT3G60750.2,Transketolase,439,,,,,-0.5496883,0.0175350,NO
C,S-nitrosylation,GIGDCFGR,5,AT3G08580.1,"ADP/ATP carrier 1",130,,,,,-0.0757460,0.6739393,NO
C,S-nitrosylation,GIGDCFGR,5,AT3G08580.2,"ADP/ATP carrier 1",130,,,,,-0.0757460,0.6739393,NO
C,S-nitrosylation,LGDVISVHQCPDVK,10,AT3G09840.1,"cell division cycle 48",109,,,,,0.2616088,0.0037953,NO
C,S-nitrosylation,LGDVISVHQCPDVK,10,AT3G53230.1,"ATPase, AAA-type, CDC48 protein",110,,,,,0.2616088,0.0037953,NO
C,S-nitrosylation,LGDVISVHQCPDVK,10,AT5G03340.1,"ATPase, AAA-type, CDC48 protein",109,,,,,0.2616088,0.0037953,NO
C,S-nitrosylation,TIAECLADELINAAK,5,AT2G37270.1,"ribosomal protein 5B",175,,,,,0.0303885,0.9563753,NO
C,S-nitrosylation,TIAECLADELINAAK,5,AT2G37270.2,"ribosomal protein 5B",175,,,,,0.0303885,0.9563753,NO
C,S-nitrosylation,TIAECLADELINAAK,5,AT3G11940.1,"ribosomal protein 5A",175,,,,,0.0303885,0.9563753,NO
C,S-nitrosylation,TIAECLADELINAAK,5,AT3G11940.2,"ribosomal protein 5A",175,,,,,0.0303885,0.9563753,NO
C,S-nitrosylation,VCTDLVR,2,AT3G45030.1,"Ribosomal protein S10p/S20e family protein",41,,,,,,,
C,S-nitrosylation,VCTDLVR,2,AT3G47370.1,"Ribosomal protein S10p/S20e family protein",39,,,,,,,
C,S-nitrosylation,VCTDLVR,2,AT3G47370.2,"Ribosomal protein S10p/S20e family protein",39,,,,,,,
C,S-nitrosylation,VCTDLVR,2,AT3G47370.3,"Ribosomal protein S10p/S20e family protein",39,,,,,,,
C,S-nitrosylation,VCTDLVR,2,AT5G62300.1,"Ribosomal protein S10p/S20e family protein",41,,,,,,,
C,S-nitrosylation,VCTDLVR,2,AT5G62300.2,"Ribosomal protein S10p/S20e family protein",41,,,,,,,
C,S-nitrosylation,VAAAYDCK,7,AT3G51800.1,"metallopeptidase M24 family protein",178,,,,,0.2569105,0.0206644,NO
C,S-nitrosylation,VAAAYDCK,7,AT3G51800.2,"metallopeptidase M24 family protein",178,,,,,0.2569105,0.0206644,NO
C,S-nitrosylation,VAAAYDCK,7,AT3G51800.3,"metallopeptidase M24 family protein",178,,,,,0.2569105,0.0206644,NO
C,S-nitrosylation,GCEVIVSGK,2,AT2G31610.1,"Ribosomal protein S3 family protein",134,,,,,0.2413980,0.3297275,NO
C,S-nitrosylation,GCEVIVSGK,2,AT3G53870.1,"Ribosomal protein S3 family protein",134,,,,,0.2413980,0.3297275,NO
C,S-nitrosylation,GCEVIVSGK,2,AT5G35530.1,"Ribosomal protein S3 family protein",134,,,,,0.2413980,0.3297275,NO
C,S-nitrosylation,VIACVGETLEER,4,AT3G55440.1,"triosephosphate isomerase",127,,,,,0.2134647,0.1613196,NO
C,S-nitrosylation,IIYGGSVNGGNCK,12,AT3G55440.1,"triosephosphate isomerase",218,,,,,,,
C,S-nitrosylation,APLLIGCDVR,7,AT3G56310.1,"Melibiase family protein",311,,,,,-0.3460227,0.1583464,NO
C,S-nitrosylation,APLLIGCDVR,7,AT3G56310.2,"Melibiase family protein",287,,,,,-0.3460227,0.1583464,NO
C,S-nitrosylation,VTEGCEAYVAAK,5,AT3G61440.1,"cysteine synthase C1",72,,,,,0.2674887,0.1071466,NO
C,S-nitrosylation,VTEGCEAYVAAK,5,AT3G61440.4,"cysteine synthase C1",72,,,,,0.2674887,0.1071466,NO
C,S-nitrosylation,IVCENTLDAR,3,AT1G64200.1,"vacuolar H+-ATPase subunit E isoform 3",207,,,,,-0.1665678,0.3451288,NO
C,S-nitrosylation,IVCENTLDAR,3,AT1G64200.2,"vacuolar H+-ATPase subunit E isoform 3",207,,,,,-0.1665678,0.3451288,NO
C,S-nitrosylation,IVCENTLDAR,3,AT3G08560.1,"vacuolar H+-ATPase subunit E isoform 2",203,,,,,-0.1665678,0.3451288,NO
C,S-nitrosylation,IVCENTLDAR,3,AT4G11150.1,"vacuolar ATP synthase subunit E1",201,,,,,-0.1665678,0.3451288,NO
C,S-nitrosylation,TNCNFDSSGR,3,AT4G11650.1,"osmotin 34",72,,,,,,,
C,S-nitrosylation,VYIGSCTGGK,6,AT4G13430.1,"isopropyl malate isomerase large subunit 1",376,,,,,-0.2573933,0.2482619,NO
C,S-nitrosylation,FDNLYGCR,7,AT3G23810.1,"S-adenosyl-l-homocysteine (SAH) hydrolase 2",244,,,,,,,
C,S-nitrosylation,FDNLYGCR,7,AT4G13940.1,"S-adenosyl-L-homocysteine hydrolase",244,,,,,,,
C,S-nitrosylation,FDNLYGCR,7,AT4G13940.2,"S-adenosyl-L-homocysteine hydrolase",123,,,,,,,
C,S-nitrosylation,FDNLYGCR,7,AT4G13940.3,"S-adenosyl-L-homocysteine hydrolase",199,,,,,,,
C,S-nitrosylation,FDNLYGCR,7,AT4G13940.4,"S-adenosyl-L-homocysteine hydrolase",244,,,,,,,
C,S-nitrosylation,VAVICGYGDVGK,5,AT3G23810.1,"S-adenosyl-l-homocysteine (SAH) hydrolase 2",268,,,,,,,
C,S-nitrosylation,VAVICGYGDVGK,5,AT4G13940.1,"S-adenosyl-L-homocysteine hydrolase",268,,,,,,,
C,S-nitrosylation,VAVICGYGDVGK,5,AT4G13940.2,"S-adenosyl-L-homocysteine hydrolase",147,,,,,,,
C,S-nitrosylation,VAVICGYGDVGK,5,AT4G13940.3,"S-adenosyl-L-homocysteine hydrolase",223,,,,,,,
C,S-nitrosylation,VAVICGYGDVGK,5,AT4G13940.4,"S-adenosyl-L-homocysteine hydrolase",268,,,,,,,
C,S-nitrosylation,CMEPVEK,1,AT3G09440.1,"Heat shock protein 70 (Hsp 70) family protein",319,,,,,,,
C,S-nitrosylation,CMEPVEK,1,AT3G09440.2,"Heat shock protein 70 (Hsp 70) family protein",319,,,,,,,
C,S-nitrosylation,CMEPVEK,1,AT3G09440.3,"Heat shock protein 70 (Hsp 70) family protein",319,,,,,,,
C,S-nitrosylation,CMEPVEK,1,AT3G09440.4,"Heat shock protein 70 (Hsp 70) family protein",319,,,,,,,
C,S-nitrosylation,CMEPVEK,1,AT3G12580.1,"heat shock protein 70",319,,,,,,,
C,S-nitrosylation,CMEPVEK,1,AT5G02490.1,"Heat shock protein 70 (Hsp 70) family protein",319,,,,,,,
C,S-nitrosylation,CMEPVEK,1,AT5G02500.1,"heat shock cognate protein 70-1",319,,,,,,,
C,S-nitrosylation,CMEPVEK,1,AT5G02500.2,"heat shock cognate protein 70-1",319,,,,,,,
C,S-nitrosylation,CNMQIDPAK,1,AT5G14040.1,"phosphate transporter 3;1",104,,,,,0.3179391,0.1322931,NO
C,S-nitrosylation,ETPAIDVCK,8,AT3G01010.1,"UDP-glucose/GDP-mannose dehydrogenase family protein",30,,,,,0.6768348,0.0350553,YES
C,S-nitrosylation,ETPAIDVCK,8,AT3G29360.1,"UDP-glucose 6-dehydrogenase family protein",350,,,,,0.6768348,0.0350553,YES
C,S-nitrosylation,ETPAIDVCK,8,AT3G29360.2,"UDP-glucose 6-dehydrogenase family protein",350,,,,,0.6768348,0.0350553,YES
C,S-nitrosylation,ETPAIDVCK,8,AT5G15490.1,"UDP-glucose 6-dehydrogenase family protein",350,,,,,0.6768348,0.0350553,YES
C,S-nitrosylation,ETPAIDVCK,8,AT5G39320.1,"UDP-glucose 6-dehydrogenase family protein",350,,,,,0.6768348,0.0350553,YES
C,S-nitrosylation,EAQMCNVLGR,5,AT5G25100.1,"Endomembrane protein 70 protein family",104,,,,,0.0663954,0.5338621,NO
C,S-nitrosylation,EAQMCNVLGR,5,AT5G25100.2,"Endomembrane protein 70 protein family",111,,,,,0.0663954,0.5338621,NO
C,S-nitrosylation,SSVCDIAPK,4,AT5G44340.1,"tubulin beta chain 4",354,,,,,0.0270082,0.2274748,NO
C,S-nitrosylation,FQEGLECGGAYLK,7,AT5G07340.1,"Calreticulin family protein",110,,,,,0.5669350,0.0026399,NO
C,S-nitrosylation,FQEGLECGGAYLK,7,AT5G07340.2,"Calreticulin family protein",118,,,,,0.5669350,0.0026399,NO
C,S-nitrosylation,FQEGLECGGAYLK,7,AT5G61790.1,"calnexin 1",108,,,,,0.5669350,0.0026399,NO
C,S-nitrosylation,INVYYNEASCGR,10,AT5G62690.1,"tubulin beta chain 2",56,,,,,-0.0751563,0.5252911,NO
C,S-nitrosylation,INVYYNEASCGR,10,AT5G62700.1,"tubulin beta chain 3",56,,,,,-0.0751563,0.5252911,NO
C,S-nitrosylation,NMMCAADPR,4,AT1G20010.1,"tubulin beta-5 chain",302,,,,,,,
C,S-nitrosylation,NMMCAADPR,4,AT1G75780.1,"tubulin beta-1 chain",302,,,,,,,
C,S-nitrosylation,NMMCAADPR,4,AT2G29550.1,"tubulin beta-7 chain",301,,,,,,,
C,S-nitrosylation,NMMCAADPR,4,AT4G20890.1,"tubulin beta-9 chain",301,,,,,,,
C,S-nitrosylation,NMMCAADPR,4,AT5G12250.1,"beta-6 tubulin",301,,,,,,,
C,S-nitrosylation,NMMCAADPR,4,AT5G23860.1,"tubulin beta 8",301,,,,,,,
C,S-nitrosylation,NMMCAADPR,4,AT5G23860.2,"tubulin beta 8",301,,,,,,,
C,S-nitrosylation,NMMCAADPR,4,AT5G44340.1,"tubulin beta chain 4",301,,,,,,,
C,S-nitrosylation,NMMCAADPR,4,AT5G62690.1,"tubulin beta chain 2",301,,,,,,,
C,S-nitrosylation,NMMCAADPR,4,AT5G62700.1,"tubulin beta chain 3",301,,,,,,,
C,S-nitrosylation,DFGYSFPCDGPGR,8,ATCG00340.1,"Photosystem I, PsaA/PsaB protein",559,,,,,-0.0318389,0.6602587,NO
C,S-nitrosylation,AVYECLR,5,AT2G07732.1,"Ribulose bisphosphate carboxylase large chain, catalytic domain-containing protein",24,,,,,-0.5826288,0.0920074,NO
C,S-nitrosylation,AVYECLR,5,ATCG00490.1,"ribulose-bisphosphate carboxylase",192,,,,,-0.5826288,0.0920074,NO
C,S-nitrosylation,AVYECLR,5,ATMG00280.1,"Ribulose bisphosphate carboxylase large chain, catalytic domain-containing protein",24,,,,,-0.5826288,0.0920074,NO
C,S-nitrosylation,VALEACVQAR,6,ATCG00490.1,"ribulose-bisphosphate carboxylase",427,,,,,-0.2226058,0.2162271,NO
C,S-nitrosylation,LPLFGCTDSAQVLK,6,AT1G67090.1,"ribulose bisphosphate carboxylase small chain 1A",132,,,,,,,
C,S-nitrosylation,LPLFGCTDSAQVLK,6,AT5G38410.1,"Ribulose bisphosphate carboxylase (small chain) family protein",132,,,,,,,
C,S-nitrosylation,LPLFGCTDSAQVLK,6,AT5G38410.2,"Ribulose bisphosphate carboxylase (small chain) family protein",125,,,,,,,
C,S-nitrosylation,LPLFGCTDSAQVLK,6,AT5G38410.3,"Ribulose bisphosphate carboxylase (small chain) family protein",137,,,,,,,
C,S-nitrosylation,LPLFGCTDSAQVLK,6,AT5G38420.1,"Ribulose bisphosphate carboxylase (small chain) family protein",132,,,,,,,
C,S-nitrosylation,LPLFGCTDSAQVLK,6,AT5G38430.1,"Ribulose bisphosphate carboxylase (small chain) family protein",132,,,,,,,
C,S-nitrosylation,LPLFGCTDSAQVLK,6,AT5G38430.2,"Ribulose bisphosphate carboxylase (small chain) family protein",132,,,,,,,
C,S-nitrosylation,GLCAIAQAESLR,3,AT2G31610.1,"Ribosomal protein S3 family protein",97,,,,,0.0420940,0.9871335,NO
C,S-nitrosylation,GLCAIAQAESLR,3,AT3G53870.1,"Ribosomal protein S3 family protein",97,,,,,0.0420940,0.9871335,NO
C,S-nitrosylation,GLCAIAQAESLR,3,AT5G35530.1,"Ribosomal protein S3 family protein",97,,,,,0.0420940,0.9871335,NO
C,S-nitrosylation,AQCPIVER,3,AT2G37270.1,"ribosomal protein 5B",69,,,,,-0.6008482,0.0725899,NO
C,S-nitrosylation,AQCPIVER,3,AT2G37270.2,"ribosomal protein 5B",69,,,,,-0.6008482,0.0725899,NO
C,S-nitrosylation,AQCPIVER,3,AT3G11940.1,"ribosomal protein 5A",69,,,,,-0.6008482,0.0725899,NO
C,S-nitrosylation,AQCPIVER,3,AT3G11940.2,"ribosomal protein 5A",69,,,,,-0.6008482,0.0725899,NO
C,S-nitrosylation,EAILVNCSR,7,AT1G68010.1,"hydroxypyruvate reductase",271,,,,,-0.5143120,0.0090258,NO
C,S-nitrosylation,EAILVNCSR,7,AT1G68010.2,"hydroxypyruvate reductase",272,,,,,-0.5143120,0.0090258,NO
C,S-nitrosylation,EAILVNCSR,7,AT1G68010.3,"hydroxypyruvate reductase",271,,,,,-0.5143120,0.0090258,NO
C,S-nitrosylation,CDVDIR,1,AT1G18450.1,"actin-related protein 4",348,,,,,,,
C,S-nitrosylation,CDVDIR,1,AT1G49240.1,"actin 8",287,,,,,,,
C,S-nitrosylation,CDVDIR,1,AT2G37620.1,"actin 1",287,,,,,,,
C,S-nitrosylation,CDVDIR,1,AT2G37620.2,"actin 1",287,,,,,,,
C,S-nitrosylation,CDVDIR,1,AT2G37620.3,"actin 1",287,,,,,,,
C,S-nitrosylation,CDVDIR,1,AT2G37620.4,"actin 1",287,,,,,,,
C,S-nitrosylation,CDVDIR,1,AT2G42100.1,"Actin-like ATPase superfamily protein",288,,,,,,,
C,S-nitrosylation,CDVDIR,1,AT3G12110.1,actin-11,287,,,,,,,
C,S-nitrosylation,CDVDIR,1,AT3G18780.1,"actin 2",287,,,,,,,
C,S-nitrosylation,CDVDIR,1,AT3G18780.2,"actin 2",287,,,,,,,
C,S-nitrosylation,CDVDIR,1,AT3G18780.3,"actin 2",287,,,,,,,
C,S-nitrosylation,CDVDIR,1,AT3G46520.1,actin-12,287,,,,,,,
C,S-nitrosylation,CDVDIR,1,AT3G46520.2,actin-12,287,,,,,,,
C,S-nitrosylation,CDVDIR,1,AT3G53750.1,"actin 3",287,,,,,,,
C,S-nitrosylation,CDVDIR,1,AT3G53750.2,"actin 3",287,,,,,,,
C,S-nitrosylation,CDVDIR,1,AT5G09810.1,"actin 7",287,,,,,,,
C,S-nitrosylation,CDVDIR,1,AT5G59370.1,"actin 4",287,,,,,,,
C,S-nitrosylation,CDVDIR,1,AT5G59370.2,"actin 4",287,,,,,,,
C,S-nitrosylation,LTCSYPGIK,3,AT1G32060.1,phosphoribulokinase,295,,,,,-0.5374924,0.0016155,NO
C,S-nitrosylation,NISCLTR,4,AT1G04410.1,"Lactate/malate dehydrogenase family protein",155,,,,,,,
C,S-nitrosylation,YGLLCGSDGLPHLIVNGDQR,5,AT1G31330.1,"photosystem I subunit F",130,,,,,-0.2695134,0.0812578,NO
C,S-nitrosylation,YPTPPAVCSGK,8,AT4G35090.1,"catalase 2",413,,,,,-0.4596443,0.2068160,NO
C,S-nitrosylation,YPTPPAVCSGK,8,AT4G35090.2,"catalase 2",413,,,,,-0.4596443,0.2068160,NO
C,S-nitrosylation,YPTPPAVCSGK,8,AT4G35090.3,"catalase 2",413,,,,,-0.4596443,0.2068160,NO
C,S-nitrosylation,VPFISEDIALECEGK,12,AT5G64040.1,"photosystem I reaction center subunit PSI-N, chloroplast, putative / PSI-N, putative (PSAN)",155,,,,,-0.7324881,0.0008741,YES
C,S-nitrosylation,HYAHVDCPGHADYVK,7,AT4G02930.1,"GTP binding Elongation factor Tu family protein",137,,,,,,,
C,S-nitrosylation,HYAHVDCPGHADYVK,7,AT4G20360.1,"RAB GTPase homolog E1B",149,,,,,,,
C,S-nitrosylation,HYAHVDCPGHADYVK,7,AT4G20360.2,"RAB GTPase homolog E1B",149,,,,,,,
C,S-nitrosylation,GTGTANQCPTIDGGSETFSFK,8,AT3G50820.1,"photosystem II subunit O-2",113,,,,,-0.6294735,0.0136929,YES
C,S-nitrosylation,GTGTANQCPTIDGGSETFSFK,8,AT5G66570.1,"PS II oxygen-evolving complex 1",114,,,,,-0.6294735,0.0136929,YES
C,S-nitrosylation,FCFEPTSFTVK,2,AT3G50820.1,"photosystem II subunit O-2",136,,,,,,,
C,S-nitrosylation,FCFEPTSFTVK,2,AT5G66570.1,"PS II oxygen-evolving complex 1",137,,,,,,,
C,S-nitrosylation,GILDVCDEPLVSVDFR,6,AT1G12900.1,"glyceraldehyde 3-phosphate dehydrogenase A subunit 2",340,,,,,-0.6287761,0.0509931,NO
C,S-nitrosylation,GILDVCDEPLVSVDFR,6,AT1G12900.2,"glyceraldehyde 3-phosphate dehydrogenase A subunit 2",258,,,,,-0.6287761,0.0509931,NO
C,S-nitrosylation,GILDVCDEPLVSVDFR,6,AT1G12900.3,"glyceraldehyde 3-phosphate dehydrogenase A subunit 2",291,,,,,-0.6287761,0.0509931,NO
C,S-nitrosylation,GILDVCDEPLVSVDFR,6,AT1G12900.4,"glyceraldehyde 3-phosphate dehydrogenase A subunit 2",291,,,,,-0.6287761,0.0509931,NO
C,S-nitrosylation,GILDVCDEPLVSVDFR,6,AT1G12900.5,"glyceraldehyde 3-phosphate dehydrogenase A subunit 2",382,,,,,-0.6287761,0.0509931,NO
C,S-nitrosylation,GILDVCDEPLVSVDFR,6,AT3G26650.1,"glyceraldehyde 3-phosphate dehydrogenase A subunit",337,,,,,-0.6287761,0.0509931,NO
C,S-nitrosylation,EQCLALGTR,3,AT1G03130.1,"photosystem I subunit D-2",131,,,,,,,
C,S-nitrosylation,EQCLALGTR,3,AT4G02770.1,"photosystem I subunit D-1",135,,,,,,,
C,S-nitrosylation,VPIICTGNDFSTLYAPLIR,5,AT2G39730.1,"rubisco activase",282,,,,,,,
C,S-nitrosylation,VPIICTGNDFSTLYAPLIR,5,AT2G39730.2,"rubisco activase",282,,,,,,,
C,S-nitrosylation,VPIICTGNDFSTLYAPLIR,5,AT2G39730.3,"rubisco activase",282,,,,,,,
C,S-nitrosylation,ALQNTCLK,6,AT2G21330.1,"fructose-bisphosphate aldolase 1",346,,,,,,,
C,S-nitrosylation,ALQNTCLK,6,AT4G38970.1,"fructose-bisphosphate aldolase 2",345,,,,,,,
C,S-nitrosylation,GILAMDESNATCGK,12,AT4G38970.1,"fructose-bisphosphate aldolase 2",79,,,,,-0.8679063,0.0048534,YES
C,S-nitrosylation,GILAMDESNATCGK,12,AT4G38970.2,"fructose-bisphosphate aldolase 2",79,,,,,-0.8679063,0.0048534,YES
C,S-nitrosylation,ECELIHGR,2,AT2G40100.1,"light harvesting complex photosystem II",140,,,,,,,
C,S-nitrosylation,ECELIHGR,2,AT2G40100.2,"light harvesting complex photosystem II",140,,,,,,,
C,S-nitrosylation,ECELIHGR,2,AT3G08940.1,"light harvesting complex photosystem II",136,,,,,,,
C,S-nitrosylation,ECELIHGR,2,AT3G08940.2,"light harvesting complex photosystem II",136,,,,,,,
C,S-nitrosylation,ECELIHGR,2,AT5G01530.1,"light harvesting complex photosystem II",139,,,,,,,
C,S-nitrosylation,ICLPAK,2,AT3G01500.1,"carbonic anhydrase 1",180,,,,,,,
C,S-nitrosylation,ICLPAK,2,AT3G01500.2,"carbonic anhydrase 1",257,,,,,,,
C,S-nitrosylation,ICLPAK,2,AT3G01500.3,"carbonic anhydrase 1",257,,,,,,,
C,S-nitrosylation,ICLPAK,2,AT3G01500.4,"carbonic anhydrase 1",180,,,,,,,
C,S-nitrosylation,ICLPAK,2,AT5G14740.1,"carbonic anhydrase 2",252,,,,,,,
C,S-nitrosylation,ICLPAK,2,AT5G14740.2,"carbonic anhydrase 2",180,,,,,,,
C,S-nitrosylation,ICLPAK,2,AT5G14740.3,"carbonic anhydrase 2",252,,,,,,,
C,S-nitrosylation,ICLPAK,2,AT5G14740.4,"carbonic anhydrase 2",252,,,,,,,
C,S-nitrosylation,ICLPAK,2,AT5G14740.5,"carbonic anhydrase 2",252,,,,,,,
C,S-nitrosylation,ICLPAK,2,AT5G14740.6,"carbonic anhydrase 2",180,,,,,,,
C,S-nitrosylation,ICLPAK,2,AT5G14740.7,"carbonic anhydrase 2",180,,,,,,,
C,S-nitrosylation,ICLPAK,2,AT5G14740.8,"carbonic anhydrase 2",180,,,,,,,
C,S-nitrosylation,ICLPAK,2,AT5G14740.9,"carbonic anhydrase 2",180,,,,,,,
C,S-nitrosylation,VCPSHVLDFQPGDAFVVR,2,AT3G01500.1,"carbonic anhydrase 1",96,,,,,-0.1664896,0.1521729,NO
C,S-nitrosylation,VCPSHVLDFQPGDAFVVR,2,AT3G01500.2,"carbonic anhydrase 1",173,,,,,-0.1664896,0.1521729,NO
C,S-nitrosylation,VCPSHVLDFQPGDAFVVR,2,AT3G01500.3,"carbonic anhydrase 1",173,,,,,-0.1664896,0.1521729,NO
C,S-nitrosylation,VCPSHVLDFQPGDAFVVR,2,AT3G01500.4,"carbonic anhydrase 1",96,,,,,-0.1664896,0.1521729,NO
C,S-nitrosylation,DTLGQEINVTCEVQQLLGNNR,11,ATCG00480.1,"ATP synthase subunit beta",63,,,,,,,
C,S-nitrosylation,GHYLNATAGTCEEMIK,11,ATCG00490.1,"ribulose-bisphosphate carboxylase",247,,,,,0.4688896,0.0955480,NO
C,S-nitrosylation,GHYLNATAGTCEEMIK,11,ATMG00280.1,"Ribulose bisphosphate carboxylase large chain, catalytic domain-containing protein",79,,,,,0.4688896,0.0955480,NO
C,S-nitrosylation,HPGQEVFSGSTCK,12,AT2G18960.1,"H -ATPase 1",202,,,,,0.3706155,0.0396725,NO
C,S-nitrosylation,HPGQEVFSGSTCK,12,AT2G18960.2,"H -ATPase 1",138,,,,,0.3706155,0.0396725,NO
C,S-nitrosylation,HPGQEVFSGSTCK,12,AT2G18960.3,"H -ATPase 1",138,,,,,0.3706155,0.0396725,NO
C,S-nitrosylation,HPGQEVFSGSTCK,12,AT4G30190.1,"H -ATPase 2",202,,,,,0.3706155,0.0396725,NO
C,S-nitrosylation,HPGQEVFSGSTCK,12,AT4G30190.2,"H -ATPase 2",202,,,,,0.3706155,0.0396725,NO
C,S-nitrosylation,AAPICYDGFEPSGR,5,AT2G33840.1,"Tyrosyl-tRNA synthetase, class Ib, bacterial/mitochondrial",71,,,,,0.3230717,0.0211671,NO
C,S-nitrosylation,IPATAPCIPSIR,7,AT5G13420.1,"Aldolase-type TIM barrel family protein",216,,,,,,,
C,S-nitrosylation,YVSSDPCEYK,7,AT4G24490.1,"RAB geranylgeranyl transferase alpha subunit 1",335,,,,,1.1320564,0.0024098,YES
C,S-nitrosylation,YVSSDPCEYK,7,AT4G24490.2,"RAB geranylgeranyl transferase alpha subunit 1",335,,,,,1.1320564,0.0024098,YES
C,S-nitrosylation,IHVCDISEAK,4,AT2G29340.1,"NAD-dependent epimerase/dehydratase family protein",39,,,,,,,
C,S-nitrosylation,IHVCDISEAK,4,AT2G29340.2,"NAD-dependent epimerase/dehydratase family protein",39,,,,,,,
C,S-nitrosylation,IHVCDISEAK,4,AT2G29340.3,"NAD-dependent epimerase/dehydratase family protein",39,,,,,,,
C,S-nitrosylation,IHVCDISEAK,4,AT2G29340.4,"NAD-dependent epimerase/dehydratase family protein",39,,,,,,,
C,S-nitrosylation,CGEPGHMAR,1,AT2G21060.1,"glycine-rich protein 2B",141,,,,,,,
C,S-nitrosylation,CGEPGHMAR,1,AT4G38680.1,"glycine rich protein 2",134,,,,,,,