"Modified AA","PTM Type",Peptide,"Position in Peptide","Protein ID","Protein Description","Position in Protein","Localization Prob","Identification Score","Posterior Error Prob","Mass Error(ppm)","Quant log2 FC","Quant p-val/q-val/FDR","Quant Significant"
S,Phosphorylation,ASVNSPTASQMDELDDFSIGR,5,AT4G12770.1,"Chaperone DnaJ-domain superfamily protein",412,,90.0000000,,,,,
S,Phosphorylation,ASVNSPTASQMDELDDFSIGR,5,AT4G12770.2,"Chaperone DnaJ-domain superfamily protein",412,,90.0000000,,,,,
S,Phosphorylation,ASVNSPTASQMDELDDFSIGR,5,AT4G12780.1,"Chaperone DnaJ-domain superfamily protein",414,,90.0000000,,,,,
S,Phosphorylation,ASVNSPTASQMDELDDFSIGR,5,AT4G12780.2,"Chaperone DnaJ-domain superfamily protein",387,,90.0000000,,,,,
S,Phosphorylation,ASVNSPTASQMDELDDFSIGR,5,AT4G12780.3,"Chaperone DnaJ-domain superfamily protein",387,,90.0000000,,,,,
S,Phosphorylation,ASVNSPTASQMDELDDFSIGR,5,AT4G12780.4,"Chaperone DnaJ-domain superfamily protein",387,,90.0000000,,,,,
S,Phosphorylation,ASVNSPTASQMDELDDFSIGR,5,AT4G12780.5,"Chaperone DnaJ-domain superfamily protein",414,,90.0000000,,,,,
S,Phosphorylation,ASVNSPTASQMDELDDFSIGR,5,AT4G12780.6,"Chaperone DnaJ-domain superfamily protein",387,,90.0000000,,,,,
T,Phosphorylation,ISSEDEMAGMDMTR,13,AT4G13510.1,"ammonium transporter 1;1",460,,30.0000000,,,,,
S,Phosphorylation,ISTELATPDSPK,10,AT1G72390.1,"nuclear receptor coactivator",27,,48.0000000,,,,,
S,Phosphorylation,ISTELATPDSPK,10,AT1G72390.2,"nuclear receptor coactivator",27,,48.0000000,,,,,
S,Phosphorylation,EVPVGTVSVYNSPR,12,AT4G11850.1,"phospholipase D gamma 1",680,,45.0000000,,,,,
S,Phosphorylation,SSHVESEEESESELK,10,AT3G01160.1,"pre-rRNA-processing ESF1-like protein",138,,35.0000000,,,,,
S,Phosphorylation,SMSELSTGYSR,6,AT1G35580.1,"cytosolic invertase 1",49,,28.0000000,,,-0.0875717,0.6176534,NO
S,Phosphorylation,SMSELSTGYSR,6,AT1G35580.2,"cytosolic invertase 1",49,,28.0000000,,,-0.0875717,0.6176534,NO
S,Phosphorylation,SMSELSTGYSR,6,AT1G35580.3,"cytosolic invertase 1",49,,28.0000000,,,-0.0875717,0.6176534,NO
S,Phosphorylation,ENSGFGFLLTR,3,AT5G20490.1,"myosin family protein with Dil",1516,,22.0000000,,,,,
S,Phosphorylation,ENSGFGFLLTR,3,AT5G20490.2,"myosin family protein with Dil",1517,,22.0000000,,,,,
S,Phosphorylation,ENSGFGFLLTR,3,AT5G20490.3,"myosin family protein with Dil",1451,,22.0000000,,,,,
S,Phosphorylation,LMDVHGDYSAEDVGVK,9,AT3G04840.1,"Ribosomal protein S3Ae",236,,57.0000000,,,,,
S,Phosphorylation,GLESDEEGDDDDEEYMHR,4,AT1G15440.1,"periodic tryptophan protein 2",275,,80.0000000,,,,,
S,Phosphorylation,GLESDEEGDDDDEEYMHR,4,AT1G15440.2,"periodic tryptophan protein 2",235,,80.0000000,,,,,
S,Phosphorylation,SDSQSELSSGNSDALAIEQR,3,AT1G01960.1,"SEC7-like guanine nucleotide exchange family protein",588,,102.0000000,,,,,
S,Phosphorylation,SDSGINGVDFTEK,3,AT5G40390.1,"Raffinose synthase family protein",11,,50.0000000,,,0.6079134,0.0150306,YES
T,Phosphorylation,AGDSTPEELANATQVQGDYLPIVR,5,AT3G49010.1,"breast basic conserved 1",138,,62.0000000,,,,,
T,Phosphorylation,AGDSTPEELANATQVQGDYLPIVR,5,AT3G49010.2,"breast basic conserved 1",138,,62.0000000,,,,,
T,Phosphorylation,AGDSTPEELANATQVQGDYLPIVR,5,AT3G49010.3,"breast basic conserved 1",138,,62.0000000,,,,,
T,Phosphorylation,AGDSTPEELANATQVQGDYLPIVR,5,AT3G49010.4,"breast basic conserved 1",136,,62.0000000,,,,,
T,Phosphorylation,AGDSTPEELANATQVQGDYLPIVR,5,AT3G49010.5,"breast basic conserved 1",85,,62.0000000,,,,,
T,Phosphorylation,AGDSTPEELANATQVQGDYLPIVR,5,AT3G49010.6,"breast basic conserved 1",138,,62.0000000,,,,,
T,Phosphorylation,AGDSTPEELANATQVQGDYLPIVR,5,AT3G49010.7,"breast basic conserved 1",138,,62.0000000,,,,,
S,Phosphorylation,SISITPEIGDDIVR,3,AT3G58640.1,"Mitogen activated protein kinase kinase kinase-like protein",418,,33.0000000,,,,,
S,Phosphorylation,SISITPEIGDDIVR,3,AT3G58640.2,"Mitogen activated protein kinase kinase kinase-like protein",418,,33.0000000,,,,,
S,Phosphorylation,DIESEVEVSQEGR,4,AT3G05420.1,"acyl-CoA binding protein 4",515,,43.0000000,,,,,
S,Phosphorylation,DIESEVEVSQEGR,4,AT3G05420.2,"acyl-CoA binding protein 4",516,,43.0000000,,,,,
T,Phosphorylation,VLEQLSGQTPVFSK,9,AT2G42740.1,"ribosomal protein large subunit 16A",46,,54.0000000,,,-0.2643698,0.1894527,NO
T,Phosphorylation,VLEQLSGQTPVFSK,9,AT3G58700.1,"Ribosomal L5P family protein",46,,54.0000000,,,-0.2643698,0.1894527,NO
T,Phosphorylation,VLEQLSGQTPVFSK,9,AT4G18730.1,"ribosomal protein L16B",46,,54.0000000,,,-0.2643698,0.1894527,NO
T,Phosphorylation,VLEQLSGQTPVFSK,9,AT5G45775.1,"Ribosomal L5P family protein",36,,54.0000000,,,-0.2643698,0.1894527,NO
T,Phosphorylation,VLEQLSGQTPVFSK,9,AT5G45775.2,"Ribosomal L5P family protein",46,,54.0000000,,,-0.2643698,0.1894527,NO
S,Phosphorylation,SIEEENVPTTVDSGAADTTVK,13,AT2G30620.1,"winged-helix DNA-binding transcription factor family protein",14,,61.0000000,,,-0.0691080,0.6786751,NO
S,Phosphorylation,SIEEENVPTTVDSGAADTTVK,13,AT2G30620.2,"winged-helix DNA-binding transcription factor family protein",14,,61.0000000,,,-0.0691080,0.6786751,NO
S,Phosphorylation,VLIAEGNCGSPR,10,AT4G24620.1,"phosphoglucose isomerase 1",595,,51.0000000,,,-0.0939001,0.5973048,NO
S,Phosphorylation,SNSLSFLGK,3,AT5G22030.1,"ubiquitin-specific protease 8",263,,23.0000000,,,,,
S,Phosphorylation,SNSLSFLGK,3,AT5G22030.2,"ubiquitin-specific protease 8",305,,23.0000000,,,,,
S,Phosphorylation,ISSVDVFENWFAQHK,3,AT5G11110.1,"sucrose phosphate synthase 2F",159,,35.0000000,,,,,
S,Phosphorylation,SVSTPFMNTTAK,3,AT1G37130.1,"nitrate reductase 2",534,,57.0000000,,,-0.1264860,0.4976896,NO
S,Phosphorylation,SSHVESEEESESELK,6,AT3G01160.1,"pre-rRNA-processing ESF1-like protein",134,,35.0000000,,,,,
S,Phosphorylation,SYSGSLYR,3,AT5G14720.1,"Protein kinase superfamily protein",515,,23.0000000,,,,,
S,Phosphorylation,SYSGSLYR,3,AT5G14720.2,"Protein kinase superfamily protein",515,,23.0000000,,,,,
S,Phosphorylation,TPYHPMMDDDGSLSPR,14,AT5G52200.1,"phosphoprotein phosphatase inhibitor",47,,53.0000000,,,0.0448600,0.9211870,NO
S,Phosphorylation,VDSSGEVCGVTFK,3,AT3G22850.1,"aluminum induced protein with YGL and LRDR motifs",215,,62.0000000,,,-0.2262567,0.2555661,NO
T,Phosphorylation,GLDIDTAGHHYTV,12,AT2G18960.1,"H -ATPase 1",948,,26.0000000,,,,,
T,Phosphorylation,GLDIDTAGHHYTV,12,AT2G18960.2,"H -ATPase 1",884,,26.0000000,,,,,
T,Phosphorylation,GLDIDTAGHHYTV,12,AT2G18960.3,"H -ATPase 1",884,,26.0000000,,,,,
Y,Phosphorylation,NEVTPYLVSR,6,AT1G13350.1,"Protein kinase superfamily protein",607,,23.0000000,,,,,
Y,Phosphorylation,NEVTPYLVSR,6,AT1G13350.2,"Protein kinase superfamily protein",634,,23.0000000,,,,,
Y,Phosphorylation,NEVTPYLVSR,6,AT1G13350.3,"Protein kinase superfamily protein",680,,23.0000000,,,,,
Y,Phosphorylation,NEVTPYLVSR,6,AT3G25840.1,"Protein kinase superfamily protein",782,,23.0000000,,,,,
Y,Phosphorylation,NEVTPYLVSR,6,AT3G25840.2,"Protein kinase superfamily protein",520,,23.0000000,,,,,
S,Phosphorylation,FSTVGSDSDEYNPTLPKPR,6,AT1G17745.1,"D-3-phosphoglycerate dehydrogenase",71,,49.0000000,,,,,
S,Phosphorylation,FSTVGSDSDEYNPTLPKPR,6,AT1G17745.2,"D-3-phosphoglycerate dehydrogenase",71,,49.0000000,,,,,
S,Phosphorylation,LNSVASESYGSGGAGYQLSHGSPEAVR,22,AT1G27430.1,"GYF domain-containing protein",426,,52.0000000,,,0.4659263,0.0652714,NO
S,Phosphorylation,LNSVASESYGSGGAGYQLSHGSPEAVR,22,AT1G27430.2,"GYF domain-containing protein",426,,52.0000000,,,0.4659263,0.0652714,NO
S,Phosphorylation,LNSVASESYGSGGAGYQLSHGSPEAVR,22,AT1G27430.3,"GYF domain-containing protein",426,,52.0000000,,,0.4659263,0.0652714,NO
S,Phosphorylation,VAKPKPESPINENEIR,8,AT3G07030.1,"Alba DNA/RNA-binding protein",14,,20.0000000,,,,,
S,Phosphorylation,VAKPKPESPINENEIR,8,AT3G07030.2,"Alba DNA/RNA-binding protein",14,,20.0000000,,,,,
S,Phosphorylation,VAKPKPESPINENEIR,8,AT3G07030.3,"Alba DNA/RNA-binding protein",14,,20.0000000,,,,,
S,Phosphorylation,VAKPKPESPINENEIR,8,AT3G07030.4,"Alba DNA/RNA-binding protein",14,,20.0000000,,,,,
S,Phosphorylation,VAKPKPESPINENEIR,8,AT3G07030.5,"Alba DNA/RNA-binding protein",14,,20.0000000,,,,,
S,Phosphorylation,VNSLVQLPR,3,AT1G03590.1,"Protein phosphatase 2C family protein",448,,36.0000000,,,,,
S,Phosphorylation,VNSLVQLPR,3,AT4G03415.1,"Protein phosphatase 2C family protein",454,,36.0000000,,,,,
S,Phosphorylation,VNSLVQLPR,3,AT4G03415.2,"Protein phosphatase 2C family protein",454,,36.0000000,,,,,
S,Phosphorylation,VNSLVQLPR,3,AT4G03415.3,"Protein phosphatase 2C family protein",454,,36.0000000,,,,,
S,Phosphorylation,AVGSHCSLSEMDDLDLTR,7,AT1G35580.1,"cytosolic invertase 1",14,,53.0000000,,,,,
S,Phosphorylation,AVGSHCSLSEMDDLDLTR,7,AT1G35580.2,"cytosolic invertase 1",14,,53.0000000,,,,,
S,Phosphorylation,AVGSHCSLSEMDDLDLTR,7,AT1G35580.3,"cytosolic invertase 1",14,,53.0000000,,,,,
T,Phosphorylation,VWTMPLEGSSSSDK,3,AT3G07020.1,"UDP-Glycosyltransferase superfamily protein",82,,21.0000000,,,,,
T,Phosphorylation,VWTMPLEGSSSSDK,3,AT3G07020.2,"UDP-Glycosyltransferase superfamily protein",82,,21.0000000,,,,,
S,Phosphorylation,MLESISPR,6,AT5G47690.1,"binding protein",1299,,41.0000000,,,,,
S,Phosphorylation,MLESISPR,6,AT5G47690.2,"binding protein",1299,,41.0000000,,,,,
S,Phosphorylation,MLESISPR,6,AT5G47690.3,"binding protein",1299,,41.0000000,,,,,
S,Phosphorylation,MLESISPR,6,AT5G47690.4,"binding protein",1202,,41.0000000,,,,,
S,Phosphorylation,VSSFEALQPATR,3,AT1G74910.1,"ADP-glucose pyrophosphorylase family protein",218,,41.0000000,,,0.3092408,0.2323783,NO
S,Phosphorylation,VSSFEALQPATR,3,AT1G74910.2,"ADP-glucose pyrophosphorylase family protein",218,,41.0000000,,,0.3092408,0.2323783,NO
S,Phosphorylation,VSSFEALQPATR,3,AT1G74910.3,"ADP-glucose pyrophosphorylase family protein",218,,41.0000000,,,0.3092408,0.2323783,NO
S,Phosphorylation,APSPVNNPLLGGIPK,3,AT1G15750.1,"Transducin family protein / WD-40 repeat family protein",214,,60.0000000,,,,,
S,Phosphorylation,APSPVNNPLLGGIPK,3,AT1G15750.2,"Transducin family protein / WD-40 repeat family protein",214,,60.0000000,,,,,
S,Phosphorylation,APSPVNNPLLGGIPK,3,AT1G15750.3,"Transducin family protein / WD-40 repeat family protein",214,,60.0000000,,,,,
S,Phosphorylation,APSPVNNPLLGGIPK,3,AT1G15750.4,"Transducin family protein / WD-40 repeat family protein",214,,60.0000000,,,,,
S,Phosphorylation,SLSNDWEEHLAVK,3,AT5G56000.1,"HEAT SHOCK PROTEIN 81.4",288,,31.0000000,,,0.2368838,0.3710634,NO
S,Phosphorylation,SLSNDWEEHLAVK,3,AT5G56010.1,"heat shock protein 81-3",288,,31.0000000,,,0.2368838,0.3710634,NO
S,Phosphorylation,SLSNDWEEHLAVK,3,AT5G56030.1,"heat shock protein 81-2",288,,31.0000000,,,0.2368838,0.3710634,NO
S,Phosphorylation,SLSNDWEEHLAVK,3,AT5G56030.2,"heat shock protein 81-2",317,,31.0000000,,,0.2368838,0.3710634,NO
S,Phosphorylation,HVVDEPANEEKPSESSAALSPEK,20,AT3G05900.1,"neurofilament protein-like protein",373,,38.0000000,,,-0.0526805,0.7348142,NO
S,Phosphorylation,HVVDEPANEEKPSESSAALSPEK,20,AT3G05900.2,"neurofilament protein-like protein",346,,38.0000000,,,-0.0526805,0.7348142,NO
S,Phosphorylation,VSDLLGDDDSPSR,10,AT1G04780.1,"Ankyrin repeat family protein",435,,50.0000000,,,,,
S,Phosphorylation,VDSSQNWAGHI,3,AT5G43830.1,"aluminum induced protein with YGL and LRDR motifs",243,,43.0000000,,,-0.2620568,0.1930658,NO
S,Phosphorylation,TFGSSLSLNSGPR,7,AT1G50120.1,immunoglobulin,267,,45.0000000,,,,,
S,Phosphorylation,TFGSSLSLNSGPR,7,AT1G50120.2,immunoglobulin,267,,45.0000000,,,,,
S,Phosphorylation,LTEGCSFR,6,AT2G45710.1,"Zinc-binding ribosomal protein family protein",80,,26.0000000,,,,,
S,Phosphorylation,LTEGCSFR,6,AT3G61110.1,"ribosomal protein S27",80,,26.0000000,,,,,
S,Phosphorylation,SVETLSPFQQK,6,AT1G07110.1,"fructose-2,6-bisphosphatase",276,,29.0000000,,,,,
S,Phosphorylation,QLTFSPSFSSQSR,7,AT4G31160.1,"DDB1-CUL4 associated factor 1",1243,,31.0000000,,,,,
S,Phosphorylation,IITDYVGSPATDPMR,8,AT3G49590.1,"Autophagy-related protein 13",248,,52.0000000,,,,,
S,Phosphorylation,IITDYVGSPATDPMR,8,AT3G49590.2,"Autophagy-related protein 13",248,,52.0000000,,,,,
S,Phosphorylation,IITDYVGSPATDPMR,8,AT3G49590.3,"Autophagy-related protein 13",248,,52.0000000,,,,,
S,Phosphorylation,IEMTSPVVTK,5,AT2G37970.1,"SOUL heme-binding family protein",136,,43.0000000,,,-0.0951690,0.5932617,NO
S,Phosphorylation,IDSEGVLCGASFK,3,AT3G15450.1,"aluminum induced protein with YGL and LRDR motifs",218,,56.0000000,,,,,
S,Phosphorylation,VVEEKPASPEPVK,8,AT5G35200.1,"ENTH/ANTH/VHS superfamily protein",342,,32.0000000,,,,,
S,Phosphorylation,VVEEKPASPEPVK,8,AT5G35200.2,"ENTH/ANTH/VHS superfamily protein",342,,32.0000000,,,,,
S,Phosphorylation,SEHADSDSDTFYIPSK,6,AT5G57110.1,"autoinhibited Ca2+ -ATPase, isoform 8",27,,53.0000000,,,,,
S,Phosphorylation,SEHADSDSDTFYIPSK,6,AT5G57110.2,"autoinhibited Ca2+ -ATPase, isoform 8",27,,53.0000000,,,,,
S,Phosphorylation,SEHADSDSDTFYIPSK,6,AT5G57110.3,"autoinhibited Ca2+ -ATPase, isoform 8",27,,53.0000000,,,,,
T,Phosphorylation,TIQFVDWCPTGFK,10,AT1G04820.1,"tubulin alpha-4 chain",349,,39.0000000,,,,,
T,Phosphorylation,TIQFVDWCPTGFK,10,AT1G50010.1,"tubulin alpha-2 chain",349,,39.0000000,,,,,
T,Phosphorylation,TIQFVDWCPTGFK,10,AT1G64740.1,"alpha-1 tubulin",349,,39.0000000,,,,,
T,Phosphorylation,TIQFVDWCPTGFK,10,AT4G14960.1,"Tubulin/FtsZ family protein",349,,39.0000000,,,,,
T,Phosphorylation,TIQFVDWCPTGFK,10,AT4G14960.2,"Tubulin/FtsZ family protein",349,,39.0000000,,,,,
S,Phosphorylation,VEEEEEEDEIVESDVELEGDTVEPDNDPPQK,13,AT4G22670.1,"HSP70-interacting protein 1",89,,64.0000000,,,0.5312395,0.0345166,YES
S,Phosphorylation,SGGMLETQNVGPEEISDDEIELPEGK,16,AT1G74690.1,"IQ-domain 31",79,,40.0000000,,,,,
S,Phosphorylation,LTGMSFR,5,AT1G13440.1,"glyceraldehyde-3-phosphate dehydrogenase C2",236,,38.0000000,,,,,
S,Phosphorylation,LTGMSFR,5,AT1G13440.2,"glyceraldehyde-3-phosphate dehydrogenase C2",208,,38.0000000,,,,,
S,Phosphorylation,LTGMSFR,5,AT3G04120.1,"glyceraldehyde-3-phosphate dehydrogenase C subunit 1",236,,38.0000000,,,,,
S,Phosphorylation,IDDLVSEDLEGSEFEK,6,AT1G22530.1,"PATELLIN 2",403,,23.0000000,,,,,
S,Phosphorylation,IDDLVSEDLEGSEFEK,6,AT1G22530.2,"PATELLIN 2",369,,23.0000000,,,,,
S,Phosphorylation,SASVNVEELR,3,AT1G10900.1,"Phosphatidylinositol-4-phosphate 5-kinase family protein",224,,37.0000000,,,,,
S,Phosphorylation,SASVNVEELR,3,AT1G10900.2,"Phosphatidylinositol-4-phosphate 5-kinase family protein",224,,37.0000000,,,,,
S,Phosphorylation,SASVNVEELR,3,AT1G10900.3,"Phosphatidylinositol-4-phosphate 5-kinase family protein",224,,37.0000000,,,,,
S,Phosphorylation,ILSSLSR,3,AT1G01050.1,"pyrophosphorylase 1",24,,22.0000000,,,,,
S,Phosphorylation,ILSSLSR,3,AT1G01050.2,"pyrophosphorylase 1",24,,22.0000000,,,,,
T,Phosphorylation,VQIESGVMTAETGTYR,9,AT2G17700.1,"ACT-like protein tyrosine kinase family protein",439,,78.0000000,,,,,
S,Phosphorylation,VEPEESESDDVIIVR,6,AT1G19870.1,"IQ-domain 32",193,,42.0000000,,,0.2240137,0.4002565,NO
S,Phosphorylation,VEPEESESDDVIIVR,6,AT1G19870.2,"IQ-domain 32",10,,42.0000000,,,0.2240137,0.4002565,NO
S,Phosphorylation,MASIDVHLR,3,AT1G53310.1,"phosphoenolpyruvate carboxylase 1",11,,51.0000000,,,-0.2716615,0.1783892,NO
S,Phosphorylation,MASIDVHLR,3,AT1G53310.2,"phosphoenolpyruvate carboxylase 1",11,,51.0000000,,,-0.2716615,0.1783892,NO
S,Phosphorylation,MASIDVHLR,3,AT1G53310.3,"phosphoenolpyruvate carboxylase 1",11,,51.0000000,,,-0.2716615,0.1783892,NO
S,Phosphorylation,NSVVSPVVGAGGDSSK,5,AT2G37340.1,"arginine/serine-rich zinc knuckle-containing protein 33",256,,47.0000000,,,,,
S,Phosphorylation,NSVVSPVVGAGGDSSK,5,AT2G37340.2,"arginine/serine-rich zinc knuckle-containing protein 33",226,,47.0000000,,,,,
S,Phosphorylation,NSVVSPVVGAGGDSSK,5,AT2G37340.3,"arginine/serine-rich zinc knuckle-containing protein 33",215,,47.0000000,,,,,
S,Phosphorylation,NSVVSPVVGAGGDSSK,5,AT2G37340.4,"arginine/serine-rich zinc knuckle-containing protein 33",226,,47.0000000,,,,,
S,Phosphorylation,NSVVSPVVGAGGDSSK,5,AT2G37340.5,"arginine/serine-rich zinc knuckle-containing protein 33",215,,47.0000000,,,,,
S,Phosphorylation,NSVVSPVVGAGGDSSK,5,AT2G37340.6,"arginine/serine-rich zinc knuckle-containing protein 33",226,,47.0000000,,,,,
S,Phosphorylation,LPSPPVAQR,3,AT2G29210.1,"splicing factor PWI domain-containing protein",453,,41.0000000,,,,,
S,Phosphorylation,LPSPPVAQR,3,AT2G29210.2,"splicing factor PWI domain-containing protein",453,,41.0000000,,,,,
S,Phosphorylation,ALLIEDGGGLQSASPR,14,AT3G06550.1,"O-acetyltransferase family protein",76,,35.0000000,,,,,
S,Phosphorylation,ALLIEDGGGLQSASPR,14,AT3G06550.2,"O-acetyltransferase family protein",76,,35.0000000,,,,,
S,Phosphorylation,ALLIEDGGGLQSASPR,14,AT3G06550.3,"O-acetyltransferase family protein",75,,35.0000000,,,,,
S,Phosphorylation,SVLDTPLSSAR,8,AT1G35580.1,"cytosolic invertase 1",73,,35.0000000,,,-0.0028757,0.9126496,NO
S,Phosphorylation,SVLDTPLSSAR,8,AT1G35580.2,"cytosolic invertase 1",73,,35.0000000,,,-0.0028757,0.9126496,NO
S,Phosphorylation,SVLDTPLSSAR,8,AT1G35580.3,"cytosolic invertase 1",73,,35.0000000,,,-0.0028757,0.9126496,NO
T,Phosphorylation,SVLDTPLSSAR,5,AT1G35580.1,"cytosolic invertase 1",70,,35.0000000,,,-0.0028757,0.9126496,NO
T,Phosphorylation,SVLDTPLSSAR,5,AT1G35580.2,"cytosolic invertase 1",70,,35.0000000,,,-0.0028757,0.9126496,NO
T,Phosphorylation,SVLDTPLSSAR,5,AT1G35580.3,"cytosolic invertase 1",70,,35.0000000,,,-0.0028757,0.9126496,NO
S,Phosphorylation,SDFSPESGIADYSASPDAK,15,AT3G16310.1,"mitotic phosphoprotein N' end (MPPN) family protein",80,,76.0000000,,,,,
S,Phosphorylation,SIEEENVPTTVDSGAADTTVK,1,AT2G30620.1,"winged-helix DNA-binding transcription factor family protein",2,,57.0000000,,,,,
S,Phosphorylation,SIEEENVPTTVDSGAADTTVK,1,AT2G30620.2,"winged-helix DNA-binding transcription factor family protein",2,,57.0000000,,,,,
S,Phosphorylation,TLSYPTPPLNLQSPR,13,AT3G13300.1,"Transducin/WD40 repeat-like superfamily protein",98,,53.0000000,,,0.4298492,0.0902787,NO
S,Phosphorylation,TLSYPTPPLNLQSPR,13,AT3G13300.2,"Transducin/WD40 repeat-like superfamily protein",63,,53.0000000,,,0.4298492,0.0902787,NO
S,Phosphorylation,TLSYPTPPLNLQSPR,13,AT3G13300.3,"Transducin/WD40 repeat-like superfamily protein",98,,53.0000000,,,0.4298492,0.0902787,NO
T,Phosphorylation,GLDIETPSHYTV,11,AT4G30190.1,"H -ATPase 2",947,,55.0000000,,,,,
T,Phosphorylation,GLDIETPSHYTV,11,AT4G30190.2,"H -ATPase 2",980,,55.0000000,,,,,
S,Phosphorylation,QGSGIIGTFGQSEELR,3,AT3G01310.1,"Phosphoglycerate mutase-like family protein",358,,46.0000000,,,0.2912145,0.2628960,NO
S,Phosphorylation,QGSGIIGTFGQSEELR,3,AT3G01310.2,"Phosphoglycerate mutase-like family protein",352,,46.0000000,,,0.2912145,0.2628960,NO
S,Phosphorylation,QGSGIIGTFGQSEELR,3,AT3G01310.3,"Phosphoglycerate mutase-like family protein",323,,46.0000000,,,0.2912145,0.2628960,NO
S,Phosphorylation,QGSGIIGTFGQSEELR,3,AT5G15070.1,"Phosphoglycerate mutase-like family protein",351,,46.0000000,,,0.2912145,0.2628960,NO
S,Phosphorylation,QGSGIIGTFGQSEELR,3,AT5G15070.2,"Phosphoglycerate mutase-like family protein",351,,46.0000000,,,0.2912145,0.2628960,NO
S,Phosphorylation,QGSGIIGTFGQSEELR,3,AT5G15070.3,"Phosphoglycerate mutase-like family protein",351,,46.0000000,,,0.2912145,0.2628960,NO
S,Phosphorylation,QGSGIIGTFGQSEELR,3,AT5G15070.4,"Phosphoglycerate mutase-like family protein",351,,46.0000000,,,0.2912145,0.2628960,NO
S,Phosphorylation,QGSGIIGTFGQSEELR,3,AT5G15070.5,"Phosphoglycerate mutase-like family protein",357,,46.0000000,,,0.2912145,0.2628960,NO
S,Phosphorylation,QGSGIIGTFGQSEELR,3,AT5G15070.6,"Phosphoglycerate mutase-like family protein",110,,46.0000000,,,0.2912145,0.2628960,NO
S,Phosphorylation,QGSGIIGTFGQSEELR,3,AT5G15070.7,"Phosphoglycerate mutase-like family protein",110,,46.0000000,,,0.2912145,0.2628960,NO
S,Phosphorylation,VFCSQVSNLSTEMAR,10,AT3G13300.1,"Transducin/WD40 repeat-like superfamily protein",830,,39.0000000,,,,,
S,Phosphorylation,VFCSQVSNLSTEMAR,10,AT3G13300.2,"Transducin/WD40 repeat-like superfamily protein",795,,39.0000000,,,,,
S,Phosphorylation,VFCSQVSNLSTEMAR,10,AT3G13300.3,"Transducin/WD40 repeat-like superfamily protein",830,,39.0000000,,,,,
S,Phosphorylation,SVAVQQPIDGSPR,11,AT3G18230.1,"Octicosapeptide/Phox/Bem1p family protein",41,,39.0000000,,,,,
S,Phosphorylation,LAAPSSPFDDDSDDVDEQPLVR,12,AT4G11740.1,"Ubiquitin-like superfamily protein",295,,85.0000000,,,,,
S,Phosphorylation,LAAPSSPFDDDSDDVDEQPLVR,12,AT4G11740.2,"Ubiquitin-like superfamily protein",295,,85.0000000,,,,,
S,Phosphorylation,GWFGGGATDEVKPESPHSVEEAPK,15,AT5G52310.1,"low-temperature-responsive protein 78 (LTI78) / desiccation-responsive protein 29A (RD29A)",662,,43.0000000,,,0.5644031,0.0243615,YES
T,Phosphorylation,SLTMENENFSR,3,AT3G16270.1,"ENTH/VHS family protein",211,,42.0000000,,,,,
T,Phosphorylation,SLTMENENFSR,3,AT3G16270.2,"ENTH/VHS family protein",211,,42.0000000,,,,,
T,Phosphorylation,SLTMENENFSR,3,AT3G16270.3,"ENTH/VHS family protein",211,,42.0000000,,,,,
S,Phosphorylation,SGSPEEEHASINPAER,3,AT4G11740.1,"Ubiquitin-like superfamily protein",328,,52.0000000,,,0.0836065,0.7952780,NO
S,Phosphorylation,SGSPEEEHASINPAER,3,AT4G11740.2,"Ubiquitin-like superfamily protein",328,,52.0000000,,,0.0836065,0.7952780,NO
S,Phosphorylation,VASPENGAVR,3,AT5G52040.1,"RNA-binding (RRM/RBD/RNP motifs) family protein",254,,46.0000000,,,,,
S,Phosphorylation,VASPENGAVR,3,AT5G52040.2,"RNA-binding (RRM/RBD/RNP motifs) family protein",254,,46.0000000,,,,,
S,Phosphorylation,VASPENGAVR,3,AT5G52040.3,"RNA-binding (RRM/RBD/RNP motifs) family protein",227,,46.0000000,,,,,
S,Phosphorylation,VASPENGAVR,3,AT5G52040.4,"RNA-binding (RRM/RBD/RNP motifs) family protein",221,,46.0000000,,,,,
S,Phosphorylation,VASPENGAVR,3,AT5G52040.5,"RNA-binding (RRM/RBD/RNP motifs) family protein",213,,46.0000000,,,,,
S,Phosphorylation,VASPENGAVR,3,AT5G52040.6,"RNA-binding (RRM/RBD/RNP motifs) family protein",221,,46.0000000,,,,,
S,Phosphorylation,VASPENGAVR,3,AT5G52040.7,"RNA-binding (RRM/RBD/RNP motifs) family protein",213,,46.0000000,,,,,
S,Phosphorylation,KPVYNLDDSDDDDFVPK,9,AT2G25170.1,"chromatin remodeling factor CHD3 (PICKLE)",23,,56.0000000,,,,,
S,Phosphorylation,KPVYNLDDSDDDDFVPK,9,AT2G25170.2,"chromatin remodeling factor CHD3 (PICKLE)",40,,56.0000000,,,,,
S,Phosphorylation,KPVYNLDDSDDDDFVPK,9,AT2G25170.3,"chromatin remodeling factor CHD3 (PICKLE)",49,,56.0000000,,,,,
S,Phosphorylation,KPVYNLDDSDDDDFVPK,9,AT2G25170.4,"chromatin remodeling factor CHD3 (PICKLE)",23,,56.0000000,,,,,
S,Phosphorylation,SLTELTGSPQLR,8,AT4G34860.1,"Plant neutral invertase family protein",62,,35.0000000,,,-0.2520581,0.2092671,NO
S,Phosphorylation,SLTELTGSPQLR,8,AT4G34860.2,"Plant neutral invertase family protein",62,,35.0000000,,,-0.2520581,0.2092671,NO
S,Phosphorylation,SLTELTGSPQLR,8,AT4G34860.3,"Plant neutral invertase family protein",62,,35.0000000,,,-0.2520581,0.2092671,NO
S,Phosphorylation,SISEANIAGSSR,3,AT4G23640.1,"Potassium transporter family protein",647,,60.0000000,,,,,
T,Phosphorylation,DHQETQALDETDLEELEDMGEK,11,AT4G27585.1,"SPFH/Band 7/PHB domain-containing membrane-associated protein family",362,,66.0000000,,,-0.0437057,0.7661173,NO
T,Phosphorylation,SAPTTPINQNAAAAFAAVSEEER,5,AT4G37870.1,"phosphoenolpyruvate carboxykinase 1",66,,85.0000000,,,-0.3104545,0.1274777,NO
S,Phosphorylation,QNSSFSSYGDLTPQR,3,AT1G34220.1,"Regulator of Vps4 activity in the MVB pathway protein",499,,48.0000000,,,,,
S,Phosphorylation,QNSSFSSYGDLTPQR,3,AT1G34220.2,"Regulator of Vps4 activity in the MVB pathway protein",469,,48.0000000,,,,,
S,Phosphorylation,GGSFLAGNLSFNR,3,AT3G05090.1,"Transducin/WD40 repeat-like superfamily protein",379,,54.0000000,,,,,
S,Phosphorylation,GGSFLAGNLSFNR,3,AT3G05090.2,"Transducin/WD40 repeat-like superfamily protein",379,,54.0000000,,,,,
S,Phosphorylation,GGSFLAGNLSFNR,3,AT3G05090.3,"Transducin/WD40 repeat-like superfamily protein",379,,54.0000000,,,,,
T,Phosphorylation,GILAADESTGTIGK,11,AT2G36460.1,"Aldolase superfamily protein",35,,60.0000000,,,,,
T,Phosphorylation,GILAADESTGTIGK,11,AT3G52930.1,"Aldolase superfamily protein",35,,60.0000000,,,,,
T,Phosphorylation,GILAADESTGTIGK,11,AT4G26530.1,"Aldolase superfamily protein",35,,60.0000000,,,,,
T,Phosphorylation,GILAADESTGTIGK,11,AT4G26530.2,"Aldolase superfamily protein",35,,60.0000000,,,,,
T,Phosphorylation,GILAADESTGTIGK,11,AT4G26530.3,"Aldolase superfamily protein",35,,60.0000000,,,,,